{"text_format":"1","workbook":"xlsx","n_sheets":3,"sheets":["Cronograma","FACTORES","TABLA"],"not_rendered":{"charts":0,"images":1,"macros":1,"external_links":0,"defined_names":3,"comments":1,"pivot_tables":0},"unopened":[],"bounds":{"document_bytes":16777216,"sheet_cells":100000,"rows_first":2000,"rows_last":500,"rows_between":2000,"halvings":0,"cell_chars":16384,"cell_head_chars":4096},"cells_cut":0,"cells_raw":0,"read":"whole","date_system":"1900"}

{"sheet":"Cronograma","index":0,"n_rows":804,"n_cols":102,"rows_kept":804,"cut":false,"hidden":false,"merged":[[7,3,7,5],[7,14,7,15],[40,7,40,9],[40,11,40,13],[36,7,36,9],[36,11,36,13],[28,7,28,9],[29,7,29,9],[37,7,37,9],[37,11,37,13],[28,11,28,13],[29,11,29,13],[41,7,41,9],[42,7,42,9],[42,11,42,13],[38,11,38,13],[39,7,39,9],[39,11,39,13],[38,7,38,9],[34,7,34,9],[34,11,34,13],[32,7,32,9],[47,7,47,9],[47,11,47,13],[48,7,48,9],[48,11,48,13],[32,11,32,13],[33,7,33,9],[35,7,35,9],[35,11,35,13],[38,17,38,18],[39,17,39,18],[36,17,36,18],[28,17,28,18],[37,17,37,18],[30,7,30,9],[30,11,30,13],[31,7,31,9],[31,11,31,13],[33,11,33,13],[43,7,43,9],[43,11,43,13],[40,17,40,18],[41,17,41,18],[42,17,42,18],[43,17,43,18],[41,11,41,13],[46,7,46,9],[46,11,46,13],[45,7,45,9],[45,11,45,13],[44,7,44,9],[44,11,44,13],[57,7,57,9],[57,11,57,13],[58,7,58,9],[58,11,58,13],[55,7,55,9],[55,11,55,13],[56,7,56,9],[56,11,56,13],[53,7,53,9],[53,11,53,13],[54,7,54,9],[54,11,54,13],[51,7,51,9],[51,11,51,13],[52,7,52,9],[52,11,52,13],[49,7,49,9],[49,11,49,13],[50,7,50,9],[50,11,50,13],[67,7,67,9],[67,11,67,13],[68,7,68,9],[68,11,68,13],[65,7,65,9],[65,11,65,13],[66,7,66,9],[66,11,66,13],[63,7,63,9],[63,11,63,13],[64,7,64,9],[64,11,64,13],[61,7,61,9],[61,11,61,13],[62,7,62,9],[62,11,62,13],[59,7,59,9],[59,11,59,13],[60,7,60,9],[60,11,60,13],[77,7,77,9],[77,11,77,13],[78,7,78,9],[78,11,78,13],[75,7,75,9],[75,11,75,13],[76,7,76,9],[76,11,76,13],[73,7,73,9],[73,11,73,13],[74,7,74,9],[74,11,74,13],[71,7,71,9],[71,11,71,13],[72,7,72,9],[72,11,72,13],[70,7,70,9],[70,11,70,13],[87,7,87,9],[87,11,87,13],[88,7,88,9],[88,11,88,13],[85,7,85,9],[85,11,85,13],[86,7,86,9],[86,11,86,13],[83,7,83,9],[83,11,83,13],[84,7,84,9],[84,11,84,13],[81,7,81,9],[81,11,81,13],[82,7,82,9],[82,11,82,13],[79,7,79,9],[79,11,79,13],[80,7,80,9],[80,11,80,13],[97,7,97,9],[97,11,97,13],[98,7,98,9],[98,11,98,13],[95,7,95,9],[95,11,95,13],[96,7,96,9],[96,11,96,13],[93,7,93,9],[93,11,93,13],[94,7,94,9],[94,11,94,13],[91,7,91,9],[91,11,91,13],[92,7,92,9],[92,11,92,13],[89,7,89,9],[89,11,89,13],[90,7,90,9],[90,11,90,13],[107,7,107,9],[107,11,107,13],[108,7,108,9],[108,11,108,13],[105,7,105,9],[105,11,105,13],[106,7,106,9],[106,11,106,13],[103,7,103,9],[103,11,103,13],[104,7,104,9],[104,11,104,13],[101,7,101,9],[101,11,101,13],[102,7,102,9],[102,11,102,13],[99,7,99,9],[99,11,99,13],[100,7,100,9],[100,11,100,13],[117,7,117,9],[117,11,117,13],[118,7,118,9],[118,11,118,13],[115,7,115,9],[115,11,115,13],[116,7,116,9],[116,11,116,13],[113,7,113,9],[113,11,113,13],[114,7,114,9],[114,11,114,13],[111,7,111,9],[111,11,111,13],[112,7,112,9],[112,11,112,13],[109,7,109,9],[109,11,109,13],[110,7,110,9],[110,11,110,13],[127,7,127,9],[127,11,127,13],[128,7,128,9],[128,11,128,13],[125,7,125,9],[125,11,125,13],[126,7,126,9],[126,11,126,13],[123,7,123,9],[123,11,123,13],[124,7,124,9],[124,11,124,13],[121,7,121,9],[121,11,121,13],[122,7,122,9],[122,11,122,13],[119,7,119,9],[119,11,119,13],[120,7,120,9],[120,11,120,13],[137,7,137,9],[137,11,137,13],[138,7,138,9],[138,11,138,13],[135,7,135,9],[135,11,135,13],[136,7,136,9],[136,11,136,13],[133,7,133,9],[133,11,133,13],[134,7,134,9],[134,11,134,13],[131,7,131,9],[131,11,131,13],[132,7,132,9],[132,11,132,13],[129,7,129,9],[129,11,129,13],[130,7,130,9],[130,11,130,13],[147,7,147,9],[147,11,147,13],[148,7,148,9],[148,11,148,13],[145,7,145,9],[145,11,145,13],[146,7,146,9],[146,11,146,13],[143,7,143,9],[143,11,143,13],[144,7,144,9],[144,11,144,13],[141,7,141,9],[141,11,141,13],[142,7,142,9],[142,11,142,13],[139,7,139,9],[139,11,139,13],[140,7,140,9],[140,11,140,13],[157,7,157,9],[157,11,157,13],[158,7,158,9],[158,11,158,13],[155,7,155,9],[155,11,155,13],[156,7,156,9],[156,11,156,13],[153,7,153,9],[153,11,153,13],[154,7,154,9],[154,11,154,13],[151,7,151,9],[151,11,151,13],[152,7,152,9],[152,11,152,13],[149,7,149,9],[149,11,149,13],[150,7,150,9],[150,11,150,13],[167,7,167,9],[167,11,167,13],[168,7,168,9],[168,11,168,13],[165,7,165,9],[165,11,165,13],[166,7,166,9],[166,11,166,13],[163,7,163,9],[163,11,163,13],[164,7,164,9],[164,11,164,13],[161,7,161,9],[161,11,161,13],[162,7,162,9],[162,11,162,13],[159,7,159,9],[159,11,159,13],[160,7,160,9],[160,11,160,13],[177,7,177,9],[177,11,177,13],[178,7,178,9],[178,11,178,13],[175,7,175,9],[175,11,175,13],[176,7,176,9],[176,11,176,13],[173,7,173,9],[173,11,173,13],[174,7,174,9],[174,11,174,13],[171,7,171,9],[171,11,171,13],[172,7,172,9],[172,11,172,13],[169,7,169,9],[169,11,169,13],[170,7,170,9],[170,11,170,13],[187,7,187,9],[187,11,187,13],[188,7,188,9],[188,11,188,13],[185,7,185,9],[185,11,185,13],[186,7,186,9],[186,11,186,13],[183,7,183,9],[183,11,183,13],[184,7,184,9],[184,11,184,13],[181,7,181,9],[181,11,181,13],[182,7,182,9],[182,11,182,13],[179,7,179,9],[179,11,179,13],[180,7,180,9],[180,11,180,13],[197,7,197,9],[197,11,197,13],[198,7,198,9],[198,11,198,13],[195,7,195,9],[195,11,195,13],[196,7,196,9],[196,11,196,13],[193,7,193,9],[193,11,193,13],[194,7,194,9],[194,11,194,13],[191,7,191,9],[191,11,191,13],[192,7,192,9],[192,11,192,13],[189,7,189,9],[189,11,189,13],[190,7,190,9],[190,11,190,13],[207,7,207,9],[207,11,207,13],[208,7,208,9],[208,11,208,13],[205,7,205,9],[205,11,205,13],[206,7,206,9],[206,11,206,13],[203,7,203,9],[203,11,203,13],[204,7,204,9],[204,11,204,13],[201,7,201,9],[201,11,201,13],[202,7,202,9],[202,11,202,13],[199,7,199,9],[199,11,199,13],[200,7,200,9],[200,11,200,13],[217,7,217,9],[217,11,217,13],[218,7,218,9],[218,11,218,13],[215,7,215,9],[215,11,215,13],[216,7,216,9],[216,11,216,13],[213,7,213,9],[213,11,213,13],[214,7,214,9],[214,11,214,13],[211,7,211,9],[211,11,211,13],[212,7,212,9],[212,11,212,13],[209,7,209,9],[209,11,209,13],[210,7,210,9],[210,11,210,13],[227,7,227,9],[227,11,227,13],[228,7,228,9],[228,11,228,13],[225,7,225,9],[225,11,225,13],[226,7,226,9],[226,11,226,13],[223,7,223,9],[223,11,223,13],[224,7,224,9],[224,11,224,13],[221,7,221,9],[221,11,221,13],[222,7,222,9],[222,11,222,13],[219,7,219,9],[219,11,219,13],[220,7,220,9],[220,11,220,13],[237,7,237,9],[237,11,237,13],[238,7,238,9],[238,11,238,13],[235,7,235,9],[235,11,235,13],[236,7,236,9],[236,11,236,13],[233,7,233,9],[233,11,233,13],[234,7,234,9],[234,11,234,13],[231,7,231,9],[231,11,231,13],[232,7,232,9],[232,11,232,13],[229,7,229,9],[229,11,229,13],[230,7,230,9],[230,11,230,13],[247,7,247,9],[247,11,247,13],[248,7,248,9],[248,11,248,13],[245,7,245,9],[245,11,245,13],[246,7,246,9],[246,11,246,13],[243,7,243,9],[243,11,243,13],[244,7,244,9],[244,11,244,13],[241,7,241,9],[241,11,241,13],[242,7,242,9],[242,11,242,13],[239,7,239,9],[239,11,239,13],[240,7,240,9],[240,11,240,13],[258,11,258,13],[255,7,255,9],[255,11,255,13],[256,7,256,9],[256,11,256,13],[253,7,253,9],[253,11,253,13],[254,7,254,9],[254,11,254,13],[251,7,251,9],[251,11,251,13],[252,7,252,9],[252,11,252,13],[249,7,249,9],[249,11,249,13],[250,7,250,9],[250,11,250,13],[269,7,269,9],[269,11,269,13],[29,17,29,18],[30,17,30,18],[31,17,31,18],[32,17,32,18],[33,17,33,18],[34,17,34,18],[35,17,35,18],[267,7,267,9],[267,11,267,13],[268,7,268,9],[268,11,268,13],[265,7,265,9],[265,11,265,13],[266,7,266,9],[266,11,266,13],[263,7,263,9],[263,11,263,13],[264,7,264,9],[264,11,264,13],[261,7,261,9],[261,11,261,13],[262,7,262,9],[262,11,262,13],[259,7,259,9],[259,11,259,13],[260,7,260,9],[260,11,260,13],[257,7,257,9],[257,11,257,13],[258,7,258,9],[52,17,52,18],[53,17,53,18],[66,17,66,18],[67,17,67,18],[56,17,56,18],[57,17,57,18],[58,17,58,18],[59,17,59,18],[60,17,60,18],[61,17,61,18],[54,17,54,18],[55,17,55,18],[44,17,44,18],[45,17,45,18],[46,17,46,18],[47,17,47,18],[48,17,48,18],[49,17,49,18],[50,17,50,18],[51,17,51,18],[80,17,80,18],[81,17,81,18],[82,17,82,18],[83,17,83,18],[84,17,84,18],[85,17,85,18],[86,17,86,18],[87,17,87,18],[62,17,62,18],[63,17,63,18],[64,17,64,18],[65,17,65,18],[72,17,72,18],[73,17,73,18],[78,17,78,18],[79,17,79,18],[68,17,68,18],[70,17,70,18],[71,17,71,18],[76,17,76,18],[77,17,77,18],[74,17,74,18],[75,17,75,18],[98,17,98,18],[99,17,99,18],[100,17,100,18],[101,17,101,18],[108,17,108,18],[109,17,109,18],[114,17,114,18],[115,17,115,18],[104,17,104,18],[105,17,105,18],[106,17,106,18],[107,17,107,18],[112,17,112,18],[113,17,113,18],[110,17,110,18],[111,17,111,18],[88,17,88,18],[89,17,89,18],[102,17,102,18],[103,17,103,18],[92,17,92,18],[93,17,93,18],[94,17,94,18],[95,17,95,18],[96,17,96,18],[97,17,97,18],[90,17,90,18],[91,17,91,18],[124,17,124,18],[125,17,125,18],[138,17,138,18],[139,17,139,18],[128,17,128,18],[129,17,129,18],[130,17,130,18],[131,17,131,18],[132,17,132,18],[133,17,133,18],[126,17,126,18],[127,17,127,18],[116,17,116,18],[117,17,117,18],[118,17,118,18],[119,17,119,18],[120,17,120,18],[121,17,121,18],[122,17,122,18],[123,17,123,18],[152,17,152,18],[153,17,153,18],[154,17,154,18],[155,17,155,18],[156,17,156,18],[157,17,157,18],[158,17,158,18],[159,17,159,18],[134,17,134,18],[135,17,135,18],[136,17,136,18],[137,17,137,18],[144,17,144,18],[145,17,145,18],[150,17,150,18],[151,17,151,18],[140,17,140,18],[141,17,141,18],[142,17,142,18],[143,17,143,18],[148,17,148,18],[149,17,149,18],[146,17,146,18],[147,17,147,18],[170,17,170,18],[171,17,171,18],[172,17,172,18],[173,17,173,18],[180,17,180,18],[181,17,181,18],[186,17,186,18],[187,17,187,18],[176,17,176,18],[177,17,177,18],[178,17,178,18],[179,17,179,18],[184,17,184,18],[185,17,185,18],[182,17,182,18],[183,17,183,18],[160,17,160,18],[161,17,161,18],[174,17,174,18],[175,17,175,18],[164,17,164,18],[165,17,165,18],[166,17,166,18],[167,17,167,18],[168,17,168,18],[169,17,169,18],[162,17,162,18],[163,17,163,18],[196,17,196,18],[197,17,197,18],[210,17,210,18],[211,17,211,18],[200,17,200,18],[201,17,201,18],[202,17,202,18],[203,17,203,18],[204,17,204,18],[205,17,205,18],[198,17,198,18],[199,17,199,18],[188,17,188,18],[189,17,189,18],[190,17,190,18],[191,17,191,18],[192,17,192,18],[193,17,193,18],[194,17,194,18],[195,17,195,18],[224,17,224,18],[225,17,225,18],[226,17,226,18],[227,17,227,18],[228,17,228,18],[229,17,229,18],[230,17,230,18],[231,17,231,18],[206,17,206,18],[207,17,207,18],[208,17,208,18],[209,17,209,18],[216,17,216,18],[217,17,217,18],[222,17,222,18],[223,17,223,18],[212,17,212,18],[213,17,213,18],[214,17,214,18],[215,17,215,18],[220,17,220,18],[221,17,221,18],[218,17,218,18],[219,17,219,18],[259,17,259,18],[248,17,248,18],[249,17,249,18],[250,17,250,18],[251,17,251,18],[256,17,256,18],[257,17,257,18],[254,17,254,18],[255,17,255,18],[232,17,232,18],[233,17,233,18],[246,17,246,18],[247,17,247,18],[236,17,236,18],[237,17,237,18],[238,17,238,18],[239,17,239,18],[240,17,240,18],[241,17,241,18],[234,17,234,18],[235,17,235,18],[277,11,277,13],[278,11,278,13],[279,11,279,13],[280,11,280,13],[281,11,281,13],[282,11,282,13],[271,11,271,13],[272,11,272,13],[273,11,273,13],[274,11,274,13],[275,11,275,13],[276,11,276,13],[69,7,69,9],[69,11,69,13],[69,17,69,18],[260,17,260,18],[261,17,261,18],[262,17,262,18],[242,17,242,18],[243,17,243,18],[244,17,244,18],[245,17,245,18],[263,17,263,18],[268,17,268,18],[269,17,269,18],[264,17,264,18],[265,17,265,18],[266,17,266,18],[267,17,267,18],[252,17,252,18],[253,17,253,18],[258,17,258,18],[295,11,295,13],[296,11,296,13],[297,11,297,13],[298,11,298,13],[299,11,299,13],[300,11,300,13],[289,11,289,13],[290,11,290,13],[291,11,291,13],[292,11,292,13],[293,11,293,13],[294,11,294,13],[283,11,283,13],[284,11,284,13],[285,11,285,13],[286,11,286,13],[287,11,287,13],[288,11,288,13],[313,11,313,13],[314,11,314,13],[315,11,315,13],[316,11,316,13],[317,11,317,13],[318,11,318,13],[307,11,307,13],[308,11,308,13],[309,11,309,13],[310,11,310,13],[311,11,311,13],[312,11,312,13],[301,11,301,13],[302,11,302,13],[303,11,303,13],[304,11,304,13],[305,11,305,13],[306,11,306,13],[331,11,331,13],[332,11,332,13],[333,11,333,13],[334,11,334,13],[335,11,335,13],[336,11,336,13],[325,11,325,13],[326,11,326,13],[327,11,327,13],[328,11,328,13],[329,11,329,13],[330,11,330,13],[319,11,319,13],[320,11,320,13],[321,11,321,13],[322,11,322,13],[323,11,323,13],[324,11,324,13],[349,11,349,13],[350,11,350,13],[351,11,351,13],[352,11,352,13],[353,11,353,13],[354,11,354,13],[343,11,343,13],[344,11,344,13],[345,11,345,13],[346,11,346,13],[347,11,347,13],[348,11,348,13],[337,11,337,13],[338,11,338,13],[339,11,339,13],[340,11,340,13],[341,11,341,13],[342,11,342,13],[367,11,367,13],[368,11,368,13],[369,11,369,13],[370,11,370,13],[371,11,371,13],[372,11,372,13],[361,11,361,13],[362,11,362,13],[363,11,363,13],[364,11,364,13],[365,11,365,13],[366,11,366,13],[355,11,355,13],[356,11,356,13],[357,11,357,13],[358,11,358,13],[359,11,359,13],[360,11,360,13],[385,11,385,13],[386,11,386,13],[387,11,387,13],[388,11,388,13],[389,11,389,13],[390,11,390,13],[379,11,379,13],[380,11,380,13],[381,11,381,13],[382,11,382,13],[383,11,383,13],[384,11,384,13],[373,11,373,13],[374,11,374,13],[375,11,375,13],[376,11,376,13],[377,11,377,13],[378,11,378,13],[403,11,403,13],[404,11,404,13],[405,11,405,13],[406,11,406,13],[407,11,407,13],[408,11,408,13],[397,11,397,13],[398,11,398,13],[399,11,399,13],[400,11,400,13],[401,11,401,13],[402,11,402,13],[391,11,391,13],[392,11,392,13],[393,11,393,13],[394,11,394,13],[395,11,395,13],[396,11,396,13],[421,11,421,13],[422,11,422,13],[423,11,423,13],[424,11,424,13],[425,11,425,13],[426,11,426,13],[415,11,415,13],[416,11,416,13],[417,11,417,13],[418,11,418,13],[419,11,419,13],[420,11,420,13],[409,11,409,13],[410,11,410,13],[411,11,411,13],[412,11,412,13],[413,11,413,13],[414,11,414,13],[439,11,439,13],[440,11,440,13],[441,11,441,13],[442,11,442,13],[443,11,443,13],[444,11,444,13],[433,11,433,13],[434,11,434,13],[435,11,435,13],[436,11,436,13],[437,11,437,13],[438,11,438,13],[427,11,427,13],[428,11,428,13],[429,11,429,13],[430,11,430,13],[431,11,431,13],[432,11,432,13],[457,11,457,13],[458,11,458,13],[459,11,459,13],[460,11,460,13],[461,11,461,13],[462,11,462,13],[451,11,451,13],[452,11,452,13],[453,11,453,13],[454,11,454,13],[455,11,455,13],[456,11,456,13],[445,11,445,13],[446,11,446,13],[447,11,447,13],[448,11,448,13],[449,11,449,13],[450,11,450,13],[475,11,475,13],[476,11,476,13],[477,11,477,13],[478,11,478,13],[479,11,479,13],[480,11,480,13],[469,11,469,13],[470,11,470,13],[471,11,471,13],[472,11,472,13],[473,11,473,13],[474,11,474,13],[463,11,463,13],[464,11,464,13],[465,11,465,13],[466,11,466,13],[467,11,467,13],[468,11,468,13],[493,11,493,13],[494,11,494,13],[495,11,495,13],[496,11,496,13],[497,11,497,13],[498,11,498,13],[487,11,487,13],[488,11,488,13],[489,11,489,13],[490,11,490,13],[491,11,491,13],[492,11,492,13],[481,11,481,13],[482,11,482,13],[483,11,483,13],[484,11,484,13],[485,11,485,13],[486,11,486,13],[511,11,511,13],[512,11,512,13],[513,11,513,13],[514,11,514,13],[515,11,515,13],[516,11,516,13],[505,11,505,13],[506,11,506,13],[507,11,507,13],[508,11,508,13],[509,11,509,13],[510,11,510,13],[499,11,499,13],[500,11,500,13],[501,11,501,13],[502,11,502,13],[503,11,503,13],[504,11,504,13],[529,11,529,13],[530,11,530,13],[531,11,531,13],[532,11,532,13],[533,11,533,13],[534,11,534,13],[523,11,523,13],[524,11,524,13],[525,11,525,13],[526,11,526,13],[527,11,527,13],[528,11,528,13],[517,11,517,13],[518,11,518,13],[519,11,519,13],[520,11,520,13],[521,11,521,13],[522,11,522,13],[547,11,547,13],[548,11,548,13],[549,11,549,13],[550,11,550,13],[551,11,551,13],[552,11,552,13],[541,11,541,13],[542,11,542,13]],"merged_total":1657,"flags":["merged_cut"]}
[]
[null,null,"NOTA: Elegir las caracteristicas del prestamo con las celdas Naranjas e ingresar datos en las celdas de Amarillo y presione el botón Calcular.",null,null,null,null,null,null,null,null,null,null,null,null,null,null,null,null,null,null,null,null,null,null,{"$f":"FACTORES!O29","v":0},{"$f":"IF(Z2>0,\"COMBO\",\"\")","v":""}]
[]
[]
[]
[null,null,null,null,null,"Monto Solicitado",34000,"Soles",null,null,"Tipo de Cronograma",null,null,null,"Tipo Producto","Compra de Deuda"]
[]
[null,null,null,"Tasa Efectiva Mensual Fija",null,null,4.67,"%",null,null,"Mensual",null,null,null,"Gracia Absoluta",null,null,null,"Fecha Fija"]
[]
[null,null,null,null,null,"Plazo (cuotas)",3,null,null,null,"Ptmos en general",null,"Nro cuotas",null,2]
[]
[null,null,null,null,null,"Fecha Desembolso","2024-07-25",null,null,null,"Cargos"]
[null,null,null,null,null,null,1]
[null,null,null,null,null,"Dia de Pago",20,null,null,null,null,"% ITF ",5.0000000000000002E-5,null,{"$f":"TRUNC(((G6/(1-$M$14))-G6),1)+(IF(MOD(((G6/(1-$M$14))-G6)*100, 10)>=5, 5,0)/100)","v":1.7}]
[null,null,null,null,null,null,null,null,null,null,null,null,null,null,null,null,null,null,null,null,null,{"$f":"IF(AND(FACTORES!O28=TRUE,AA2=\"COMBO\"),2.9*G10,0)","v":0}]
{"$rows_left_out":790}
{"sheet":"FACTORES","index":1,"n_rows":1243,"n_cols":37,"rows_kept":1243,"cut":false,"hidden":false,"merged":[[2,28,2,29]]}
["FERIADOS",null,"DESGRAVAMEN",null,null,"DESGRAVAMEN",null,null,null,null,null,"MICROSEGURO",null,null,null,"MICROSEGURO",null,null,null,"MICROSEGURO",null,null,null,"MICROSEGURO"]
[null,null,null,null,null,null,null,null,null,null,null,"NEGOCIO PROTEGIDO",null,null,null,"PROTECCION FINANCIERA",null,null,null,"NEGOCIO PROTEGIDO",null,null,null,"ONCORESPALDO"]
["FECHA","DESCRIPCION","TASA HIPOTECARIA",null,null,"PLAZO 0 ","PLAZO 1","TASA",null,null,null,"PLAZO 0 ","PLAZO 1","TASA",null,"PLAZO 0 ","PLAZO 1","TASA",null,"PLAZO 0 ","PLAZO 1","TASA",null,"PLAN","PRIMA TITULAR","PRIMA AFILIADOS",null,null,"Duración del crédito (en meses)",null,"Tasa por ciento Retorno",null,null,"monto préstamo",null,"prima individual","prima Familiar"]
["1998-01-01","AÑO NUEVO",4.3478000000000001E-4,1.25,null,6,0,4.7999999999999996E-3,null,null,null,0,1000,1.58E-3,null,0,6,2.2550000000000001E-2,null,0,5000,4.0000000000000001E-3,null,0,5,5,"nuevo",null,25,30,1.7901299999999998E-2,null,null,"< 5,000",0,5,5.5]
["1998-04-09","JUEVES SANTO",null,{"$f":"MAX($I$4:$I$23)","v":0},null,12,6.0000010000000001,8.1151999999999995E-3,null,null,null,1000.001,3000,1.0399999999999999E-3,null,7,12,2.2550000000000001E-2,null,5000.01,10000,1.289E-3,null,5000,7,7,"nuevo",null,31,36,2.1301E-2,null,null,">=5,000 y <20,000",5000,7,12]
["1998-04-10","VIERNES SANTO",null,{"$f":"MIN($I$4:$I$23)","v":0},null,18,12.000000999999999,1.091465E-2,null,null,null,null,null,null,null,13,18,2.2550000000000001E-2,null,10000.01,24000,9.3800000000000003E-4,null,20000,9,9,"nuevo",null,37,42,2.4211400000000001E-2,null,null,">=20,000 y <50,000",20000,9,18]
["1998-05-01","DIA DEL TRABAJO",null,null,null,24,18.000001000000001,1.4252529999999999E-2,null,null,null,null,null,null,null,19,24,2.3650000000000001E-2,null,24000.01,150000,9.3800000000000003E-4,null,50000,14,14,"nuevo",null,43,48,2.7489599999999999E-2,null,null,">=50,000",50000,14,18]
["1998-06-29","SAN PEDRO Y SAN PABLO",null,null,null,30,24.000001000000001,1.7512300000000001E-2,null,null,null,null,null,null,null,25,30,2.3300000000000001E-2,null,150000.01,200000,7.7399999999999995E-4,null,null,null,null,null,null,49,54,3.0749499999999999E-2]
["1998-07-28","FIESTAS PATRIAS",null,null,null,36,30.000001000000001,2.1257849999999998E-2,null,null,null,null,null,null,null,31,36,2.5600000000000001E-2,null,200000.01,21000000,7.7399999999999995E-4,null,"Combo",2.9,"no aplica","nuevo",null,55,60,3.3831800000000002E-2]
["1998-07-29","FIESTAS PATRIAS",null,null,null,42,36.000000999999997,2.41467E-2,null,null,null,null,null,null,null,37,42,2.7699999999999999E-2,null,2100000000.01,1000000000000,7.7399999999999995E-4,null,null,4.5,4.5,"ANTIGUO PLAN",null,61,66,3.7029199999999998E-2,null,null,{"$f":"VLOOKUP(Cronograma!G6,AI3:AK7,2)","v":9},"indiv"]
["1998-08-30","SANTA ROSA DE LIMA",null,null,null,48,42.000000999999997,2.789438E-2,null,null,"ITF",{"$f":"Cronograma!O14","v":1.7},null,null,null,43,48,3.1899999999999998E-2,null,null,null,null,null,null,21.9,7,"ANTIGUO PLAN",null,67,72,4.0231099999999999E-2,null,null,{"$f":"VLOOKUP(Cronograma!G6,AI3:AK7,3)","v":18},"familiar"]
["1998-10-08","COMBATE DE ANGAMOS",null,null,null,54,48.000000999999997,3.2433089999999998E-2,null,null,"Monto Neto",{"$f":"Cronograma!G6","v":34000},null,null,null,49,54,3.4599999999999999E-2,null,null,null,null,null,null,null,null,null,null,73,78,4.3387700000000001E-2]
["1998-11-01","DIA DE LOS DIFUNTOS",null,null,null,60,54.000000999999997,3.2433089999999998E-2,null,null,"Desgravamen",{"$f":"IF(Cronograma!M16=\"No\",0,IF(Cronograma!$M$16=\"Si, Tradicional\",Cronograma!CE31,Cronograma!CF31))","v":4.7999999999999996E-3},{"$f":"Cronograma!M16","v":"Si, Tradicional"},null,null,55,60,3.8699999999999998E-2,null,null,null,null,null,null,null,null,null,null,79,84,4.6551599999999999E-2]
["1998-12-08","DIA INMACULADA CONCEPCION",null,null,null,66,60.000000999999997,3.9602789999999999E-2,null,null,null,{"$f":"IF(L12=\"\",0,VLOOKUP(L12,$T$4:$V$11,3))","v":9.3800000000000003E-4},null,null,null,61,66,4.1000000000000002E-2,null,null,null,null,null,null,null,null,null,null,85,90,4.9699800000000002E-2]
["1998-12-24","NAVIDAD",null,null,null,72,66.000000999999997,3.9602789999999999E-2,null,null,"Plazo",{"$f":"Cronograma!G10","v":3},null,null,null,67,72,4.1399999999999999E-2,null,null,null,null,null,null,null,null,null,null,91,96,5.2845400000000001E-2]
{"$rows_left_out":1229}
{"sheet":"TABLA","index":2,"n_rows":20,"n_cols":7,"rows_kept":20,"cut":false,"hidden":false,"merged":[]}
["Plan","inc IGV"]
["Edificación",2.3839999999999999E-4,null,"Si, Tradicional",null,null,"Capital de trabajo"]
["Existencias/Contenido",2.9020000000000001E-4,null,"Sí, retorno",null,null,"Mi efectivo Express"]
["Maq Equipo Fijo",3.2830000000000001E-4,null,"No",null,null,"Máquinas y Equipos"]
[null,null,null,null,null,null,"Locales Comerciales"]
[null,null,null,null,null,null,"Compra de Deuda"]
[null,null,null,null,null,null,"Financiamiento para SOAT"]
[null,null,null,null,null,null,"Mercado y Galerías Comerciales"]
[null,null,null,null,null,null,"Línea de Crédito Rural"]
[null,null,null,null,null,null,"Agropecuario de Libre Amortización"]
[null,null,null,null,null,null,"Producción Ganadera"]
[null,null,null,null,null,null,"Producción Agrícola"]
[null,null,null,null,null,null,"Línea de Crédito Efectivo Altoque"]
[null,null,null,null,null,null,"Compra de Deuda Plus"]
[null,null,null,null,null,null,"Casa Propia"]
{"$rows_left_out":5}